Undefined reference to main clang error linker command failed with exit code 1

 
#
But the compiler has full control over that memory, and it's faster when the number is the same as what might eventually be written into it, but then you no longer need to write anything, since that value is already in memory, and now it's a constant and why keep a constant in memory when you can Nothing in libstdc++ > derives from __shared_ptr<_Dir> and nothing in user code is allowed to refer > to that type, because it's an implementation detail. gcc -o hello hello. text+0x20): undefined reference to ` main' clang: error: linker command failed with exit code 1 (use -v to see  20 Oct 2014 What do the following compilation errors mean and how can I fix them? to ` main' clang: error: linker command failed with exit code 1 (use -v  Summary: linking fails reproducibly with the error below whenever gcc 4. Sep 01, 2017 · > since Do is uninitialized just use the number already in memory at Do's location as an address. You can see fairly clearly that clang is failing to find a directory because of the space in the scheme name, ”NAH Distribution”. Did you run configure before ? What parameter did you pass ? This post should have been a simple refresher of some of the basics of working with C code. Oct 31, 2017 · Next thing you should do is NEVER use literal constants in Fortran for the arguments to the MATLAB API functions. The source code is compiled into object code and, upon success, linked into a program file. 3) The return 0; at the end is not needed (special case for main() function). If any of the symbols it exports are on the undefined list, the object is added to the link and the next step is executed. GitHub Gist: instantly share code, notes, and snippets. If you need to customise the main function you can remove that attribute and add a main. My Xcode is 10. error: linker command failed with exit code 1 (use -v to see invocation) main. That's pretty unusual in Windows because files inherit permissions from their parent directories and directories have execute permission. text+0x91): undefined reference to `_imp___ZNK7QWidget4sizeEv' clang++. 3 with code coverage turned on results in several 'undefined reference' linker errors. It was referenced even when building for Android and that was causing the build to fail. It looks like compiler-rt's configure + make build isn't set up build the profile libraries on linux. [Linker error] undefined reference to `WinMain@16' ld returned 1 exit status S. o Dismiss Join GitHub today. cpp:(. h> #include <pthread [MinGW] Clang issues with static libstdc++. I think the former most likely means that some command clang was trying to execute did not have execute permission. Madhu: I do not fully understand what you would like to visualize within the MEX routine. I'm trying to install a Market Tool for EVE Online called Evernus. dir/objects. Q16HDRI. Best regards, Tom 1 Answer 1. Yes, the libraries you listed are not included. clang: error: linker command failed with exit code 1 (use -vto see invocation) clang: error: linker command failed with exit code 1 (use -vto see invocation) clang: error: linker command failed with exit code 1 (use -v to see invocation) After several frustrating hours of searching the forums trying to chase it down, I'm hoping someone can help me. I also tested my search and sort alghorithms to Go to the target build settings (Command-1, select the project entry, select the appropriate target from the target list, choose the Build Settings tab in the editor) and enter "swift_version" in the filter/search field at the top right. cpp Or, if you really wish to use clang directly instead of clang++, something like: clang -x c++ -lstdc++ -o hello hello. 13. clang: error: linker command failed with exit code 1 (use -v to see invocation) Mar 21, 2016 · clang: error: linker command failed with exit code 1 (use -v to see invocation) However using "make testFile()" in Terminal works well. Please join us on Visual Studio Developer Community and in the Xamarin and Mono organizations on GitHub to continue tracking issues. o main. profile variables in make Take our customer survey to evaluate your visit. At first it couldnt even find -lACE, some tweaking later I got page upon page of undefined references to all sorts of stuff. In gcc -L option is to provide the path to the library. . o. internal. 0: error: linker command failed with exit code 1 (use -v to see invocation)  13 Sep 2018 . cache/lambdanative/build/DemoHelloWorld/fonts/main-ascii. afl-clang-fast cmake darktable build error. 4; 症状. Nov 25, 2014 · clang: error: linker (via gcc) command failed with exit code 1 (use -v to see invocation) undefined reference to `boundscheckui_debug' linker (via gcc Dec 12, 2014 · A game developer blog who challenge to done anything as record of life and learn The code look very ugly. cpp. c (without testing) Cheers, Franco Logged Cavadus You're using the wrong syntax to compile C++ code with clang. Clang then removes the object code file, 0618. Instead, you should use g++ in place of gcc, which links libstdc++ automatically. Compiling code with clang 3. c(. c Undefined symbols for architecture x86_64: "_incr", referenced from: _main in main-b06e2c. What you should do is declare C - Clang: error: linker command failed with exit code 1 with duplicate symbol _TableLookup in database. Stack Exchange network consists of 175 Q&A communities including Stack Overflow, the largest, most trusted online community for developers to learn, share their knowledge, and build their careers. so. text+0xa0): undefined reference to `QArrayData::deallocate(QArrayData*, unsigned long, unsigned long)' error: linker command failed with exit code 1 Linker command failed with exit code 1. getting error while running project. 5 has just been removed from the Debian archive unstable we hereby close the associated bug reports. Marked issue as "on hold" while we wait for (1) news whether it works with recent versions of PyPy or clang or OS/X; (2) someone with OS/X who is ready to spend a bit of time looking around the pure Python code of distutils figuring out why PyPy and CPython behave differently. 2. architecture arm64 clang: error: linker command failed with exit code 1 (use -v to see invocation). Opened by Cody Maloney (maloney) - Thursday, 03 October 2013, 00:24 GMT. o lxt2_read. ibm. Anyways as you will do more and more coding you yourself will start managing the code well. 745284s to run mono, ExitCode=5 clang ++: error: linker command failed with exit code 1 (use -v to see invocation) So the problem was related to the GameCenter plugin I've used. Linker errors: libMagickWand-7. Use this forum to discuss, make suggestions about, or report bugs concerning Magick++. obj):(. vnet. profile variables in make I'm trying to install a Market Tool for EVE Online called Evernus. o lxt. 1. clang: error: linker command failed with exit code 1 (use -v to see invocation) </code></pre> I have created an interface with the design editor that worked well but when I try to link buttons through the . Taking a look at the FUNCTIONS. If it's being hashed into a C++ overloaded name, the linker might not find it. 1 error from config. text+0x6): undefined reference to `X::STRINGS' clang: error: linker command failed with exit code 1 (use -v to see invocation) Apr 29, 2014 at 3:29am UTC Dec 12, 2014 · A game developer blog who challenge to done anything as record of life and learn clang: error: linker command failed with exit code 1 (use -v to see invocation) MINIX3 - posted in C and C++: Using clang to compile an application on Minix3 and having a little bit of trouble. You need to modify the linux-rasp-pi-g++ to use clang, then it should work. o in this example. Xcode 5- clang: error: linker command failed with exit code 1 (use -v to clang: error: linker command failed with exit code 1 (use -v to see invocation) I believe I have included the necessary links and flags in my CmakeList file, but I must be missing the order or a flag for linking. 3. f1. It should only take a few minutes to answer five quick questions. Dec 21, 2018 · build error: linker command failed with exit code 1. pset 3 ''linker command failed with exit code 1'' but instead use the command make all as stated in the makefile. Keep your eyes out for more in this series on memory segmentation. clang: error: linker command failed with exit code 1 (use -v to see invocation) After several frustrating hours of searching the forums trying to chase it down, I'm hoping someone can help me. C++ programs need to be linked with the C++ standard library. I tried to link libc++ libraries under Android Studio with NDK 16b. clang: error: linker command failed with exit code 1 (use -v to see invocation) May 15, 2015 · Version: 1:3. o memory. 8 is used. 0. [svadev] clang: error: linker (via gcc) command failed with exit code 1 (use -v to see invocation) Chronological Thread < Chronological > < Thread > Notice (2018-05-24): bugzilla. : undefined reference to `main' collect2: ld returned 1 exit status This happens whether I compile the code using a makefile or normally (via a g++ command) Anybody knows what this means? Thanks. My code so far is: I'm using Unity 2018. Using multiple frameworks gives clang: error: linker command failed with exit code 1. Back to assignment, your fruit should rather look like: Stack Exchange network consists of 175 Q&A communities including Stack Overflow, the largest, most trusted online community for developers to learn, share their knowledge, and build their careers. 2-5+rm Dear submitter, as the package llvm-toolchain-3. The fact that you say it's a linker error, means that it's unlikely to be a syntax error, more likely missing definitions, includes, or the compilation command isn't linking a library properly. AFAIK, there is no builtin terminal in Android, so no command line and no straight way to run CLI applications. Bug 860023 - Make error: "clang: error: linker command failed with exit code 1" Summary: Make error: "clang: error: linker command failed with exit code 1" Keywords : clang: error: linker command failed with exit code 1 Now there's obviously something going on with the C-thingy. 8 Jan 2017 Linker errors when building for release on iOS Undefined symbols for architecture armv7: armv7 clang: error: linker command failed with exit code 1 ( use -v to see and its code would be packaged into the code of the main executable. text+0xa0): undefined reference to `QArrayData::deallocate(QArrayData*, unsigned long, unsigned long)' error: linker command failed with exit code 1 ld: symbol(s) not found for architecture x86_64. Just click the Launch survey button at the end of your visit to begin. error: linker command failed with exit code 1 I had to change src/qt to src it order to have the building working. 2) You could write simply int main() if you don't need the command line arguments. scm . If you have included such a definition, post it, and we can take a look. 5. 6: undefined reference(s) Magick++ is an object-oriented C++ interface to ImageMagick. Hello, i'm writing some code for school purposes, i create a Qt widget Undefined symbols for architecture x86_64: clang: error: linker command failed with exit code 1 (use -v to see invocation) I've implemented the methods into the main file, and i create an header file in witch i declared the variables. The code look very ugly. cpp I think the former most likely means that some command clang was trying to execute did not have execute permission. clang: error: linker command failed with exit code 1 (use -v to see invocation) 同じ名前のクラス、変数、メソッドなどが使われている場合に発生します。 変数、メソッドの場合はソース編集中に警告が出るので悩まされることはあまりないと思いますが、クラスの場合は The code look very ugly. /src/main/jni/com_sar_pahc_DetectionBasedTracker. Although you could link the standard library manually i. Stats. Seeing the exact compilation command and error(s) would be helpful. text+0x4d): undefined reference to `pow' clang; error: linker command failed with exit code 1 (use -v to see invocation) Ugh. cpp:37: error: cv::Size_ )' clang++. Clang undefined behavior. 0 (clang-900. dll missing - Avira blocks exe when CMake target_compile_features unordered_map; Diamon Inheritance without RTTI; Are there possible troubles to use default copy co avril (735) mars (779) février (750) g++: linker issue on Mac OS X - Undefined symbols for architecture x86_64 I asked this question before here , but got no answer, just a "detour". com Thanks; please remember to Cc the port maintainer(s). Please do not post the same question in multiple forums. [RFC] configure: fix clang failure for libatomic 9697715 diff mbox Message ID: 20170425083555. Mac bug. You will not have compatibility issues here on. Please Sign up or sign in to vote. c:153: undefined reference to clang: error: linker command failed with exit code 1 (use -v to see invocation). exe: error: linker command failed with exit code 1 (use -v to  6 Nov 2014 https://bugs. Oct 05, 2016 · Re: error: linker command failed with exit code 1 (use -v to see invocation) Level 9 (14,605 points) KMT Oct 5, 2016 11:29 AM (in response to Arbeeorlar) Use Xcode's Product menu with the option key pressed, then select 'clean build folder', then try to build again. and any Swift projects, the linker stores a reference to the library,  2016年7月2日 Mac编译C++代码,clang: error: linker command failed with exit code 1 19 - fmessage-length 181 -stack-protector 1 -fblocks -fobjc-runtime=macosx-10. cpp:35: undefined reference  30 Jan 2019 CMake, cppunitの実行で「clang: error: linker command failed with exit code 1」の リンクエラー CXX executable counter_test Undefined symbols for architecture x86_64: in Main. clang: error: linker command failed with exit code 1 (use -v to see invocation). Why can't it find atlas ? Home › Forums › FLIR ONE SDK Development › iOS development › Installation and getting started › build error: linker command failed with exit code 1. I added -Wl,--copy-dt-needed-entries then it complied on Android. 13547-1-nikunj@linux. This may be peculiar to projects with sub-projects. I recently had this problem, and it turned out it was a bug in Visual Studio Express 2013. The program in this build is written in the following languages, according to sloccount: Sep 11, 2019 · Cui: We have updated the supported compiler on Windows to be Visual Studio 2015. May 31, 2018 · clang: error: linker command failed with exit code 1 (use -v to see invocation) Any ideas what could have gone wrong? I have files getvxlval. What am I missing. It should be: clang++ -o hello hello. 3. Bug 225027 - www/qupzilla-qt5 c++: error: linker command failed with exit code 1 Summary: www/qupzilla-qt5 c++: error: linker command failed with exit code 1 Status : can't fix 'Linker command failed with exit code 1(use -v to see invocation)' 4874 Views 4 Replies Latest reply on Aug 25, 2018 10:43 PM by Arman240 Stack Exchange network consists of 175 Q&A communities including Stack Overflow, the largest, most trusted online community for developers to learn, share their knowledge, and build their careers. clang: error: linker command failed with exit code 1 (use -v to see invocation) *about global variables Hot Network Questions Ground->ship Wi-Fi bandwidth in my fast moving spaceship linker command failed with exit code 1 (use -v to see invocation) on macos not found for architecture x86_64 clang: error: linker command failed with exit code 1 Dismiss Join GitHub today. Check that the code which is supposed to define it is getting compiled, and also check that main is being exported properly. o: In function 'main': 0618. text+0x1c): undefined reference to `get_int' clang: error: linker command failed with exit code 1 (use -v to see  24 Nov 2015 clang: error: linker command failed with exit code 1 (use -v to see 1. It gave me a lot of strange link errors like "undefined reference to 'std::ios_base::Init::Init()'" and many undefined references, where they are well defined in source code and it compiles on Windows and iOS. These messages are then followed by a generic clang error: UATHelper: Packaging (iOS): clang: error: linker command failed with exit code 1 (use -v to see invocation) PackagingResults: Error: linker command failed with exit code 1 (use -v to see invocation) UATHelper: Packaging (iOS): Took 23. osx. Hence, undefined reference(s)). o merge. error: linker command failed with exit code 1 (use -v to see invocation) clang: error: linker command failed with exit code 1 (use -v to see invocation) Edit Subject So when I try to run my project in Xcode (without modifying anything) on a simulator, the project builds and runs fine. Description of problem: When compiling code that requires the boost program options library, clang fails to link the library even when specified explicitly on the command line. o "CppUnit::TestRunner::run(CppUnit::TestResult&, ld: symbol(s) not found for architecture x86_64 clang: error: linker  23 Dec 2016 Below is the linker error trace which i get , when I try to build my project. text+0xa): undefined reference to `std::cout' clang-5. M. I tried to disable the bitcode but i cant find bitcode in build settings. clang: error: linker command failed with exit code 1 (use -v to see invocation) I a added the path to the libraries of instantclient 12. I'll replace it with a more recent OpenBSD whenever I next look at portability. ( www. You have to compile your program with the -fdefine-sized-deallocation flag so Take our customer survey to evaluate your visit. cpp [xcode] clang: error: linker command failed with exit code 1 (use -v to see invocation) Discussion in ' Unity Cloud Build ' started by tommyblock , Oct 28, 2014 . cpp:(. Even when quoting them properly, they can be problematic. So you have two options there: Reinsta These libraries are in /usr/local/lib which is not in standard search path so you have to make the path known to qmake. Sounds like that native library might require additional steps (add to native reference?) to integrate in your project. Oct 01, 2016 · /tmp/0618-e49f59. 0: error: linker command failed with exit code 1 (use -v to see invocation) make[2]:  I am using latest version for android openCVLibrary343. It is very hard to understand which curly bracket starts where and ends where. I had to change src/qt to src it order to have the building working. h:362: error: undefined reference to clang: error: linker command failed with exit code 1 (use -v to see  5 May 2017 Wayland 1. The clang program is both a compiler and linker. You also don’t have to Cc yourself. o ld: symbol(s) not found for architecture x86_64 clang: error: linker command failed with exit code 1 (use -v to see invocation) c,gcc,linker,undefined-reference,msgpack. o const' /usr/local/lib/libQt5Quick. evernus. The build took 00h 04m 08s and was SUCCESSFUL. Otherwise, no problem. You could give it a definition to avoid it being name-mangled. 1 (10B61). 4s with exit code 1] From this code: This causes it to be defined in all object files which include that header, and that results in the linker spurting out those errors. i'm trying to run this script : Missing 'undefined dynamic_lookup' flag. It looks straightforward but it does not compile. I would contact the library author. If you dig through the command text, it appears that Xcode doesn’t use quotes for the library passed to the -dead_strip command. I had to remove a source file from the project and re-add it to overcome the bug. You could consider running each ite Oct 07, 2015 · Hi Guys The following program is someone else's program. I keep getting errors related to building the webcam_face_pose_ex. Undefined symbols for architecture x86_64: ld: symbol(s) not found for architecture x86_64. Apr 12, 2017 · But the cloud build fails with linker errors: 4894: [xcode] Undefined symbols for architecture arm64: 4895: [xcode] "_gvr_set_default_viewer_profile", referenced from: Undefined symbols for architecture armv7: "OBJC_CLASS$_AERecorder", referenced from: objc-class-ref in CreateSong. 14. marcV2g Right, please bare with on this, it might be quite a long one, and one related issue was solved here (I think): CMake make[2]: *** No rule t main. Thanks Chong #include <stdio. clang++: error: linker command failed with exit code 1 (use -v to see invocation) However, If I just build for x86 ABI using clang3. 0 -x c++ main. Apr 25, 2017 · Peter Maydell <address@hidden> writes: > On 25 April 2017 at 09:35, Nikunj A Dadhania <address@hidden> wrote: >> Travis builds failure was reported for powernv boot-serial test with >> qemu built with clang. Dismiss Join GitHub today. tommyblock clang: error: linker command failed with exit code 1 (use -v to see invocation) in xcode5. cgi?id=194870 Bug ID: 194870 c ++: error: linker command failed with exit code 1 [. 304 signed on 2017-04-02T15:01:33Z Can't find clang # I only installed it to test some portability stuff. $ clang main. General rule of thumb on Windows: no spaces in paths, they're evil. The compiler does no longer emit weak definitions of the sized operator delete (see the commit 229241). (Your first case, it does not actually link with the library. 9 Apr 2019 [CI] [C++] LLVM-related compile errors debug/libgandiva. exe: error: linker command failed with exit code 1 clang++. i have checked and rechecked but its just not there! If i save any new file to my project it wont run. exe: error: linker command failed with exit code 1 (use -v to see invocation) Main: ERROR: AutomationTool terminated with exception:  include/c++/5. h> " | clang -x c - >> >> The Linux kernel sources mention several other MIPS-related macros >> that are specific to GCC and may A bug in the compiler/IDE. org/bugzilla/show_bug. Undefined symbols for architecture x86_64: "SnapshotUtilsEx::Draw(int  FVoiceCaptureOpenSLES::Init(int, int): error: undefined reference to clang++. Finding symbols to be placed into a final executable and relocating addresses are the main job of the linker, and will be the main theme of the posts in this series. Oct 01, 2016 · Ugh. Do. UncheckedException: Build command failed. The recent update of net/samba43 fails to build due to a linker error: smbspool_krb5_wrapper. <pre><code>ld: symbol(s) not found for architecture x86_64. Undefined symbols for architecture x86_64: for architecture x86_64 clang: error: linker command failed with exit code 1 (use -v to see invocation) make[2]:  x86_64-linux-gnu/crt1. o ld: symbol(s) not found for architecture armv7 clang: error: linker command failed with exit code 1 (use -v to see invocation) The linker adds this undefined entry only after it sees main_using_memcpy. -l option is to provide the name of the library (Your second case, it actually links with the specified library) Further read: Online gcc Clang does not appear to define this macro. com is now in read-only mode. I studied some solutions in MathWorks but did not work. h> int main( int argc, char** argv) { (void)argv; #ifndef pthread_create 11 Aug 2014 covered fails to build using clang, as it gives the following error: lexer. freebsd. text+0x19): undefined reference to `pthread_create' clang: error: linker command failed with exit code 1 (use -v to see invocation) #include <pthread. TI and its respective suppliers and providers of content make no representations about the suitability of these materials for any purpose and disclaim all warranties and conditions with regard to these materials, including but not limited to all implied warranties and conditions of merchantability, fitness for a particular purpose Submitted by Tomasz Paweł Gajc Assigned to Wayland bug list. com/reference/cmath/pow/ for more details. This is without use external ACE checked, as that failed even harder. Hi and welcome to devnet, The problem probably comes from the space in your linker paths. >> Glibc uses _MIPS_SZPTR to set the value of __WORDSIZE, so you can >> workaround the compilation issue like this: >> >> printf "#define _MIPS_SZPTR 32 #include <stdlib. All content and materials on this site are provided "as is". 1 with LTO enabled main: error: undefined reference to '__stop_test_section' clang-4. 1/bits/atomic_base. Last edited by Evangelos Foutras (foutrelis) - Thursday, 10 July 2014, 17:37 GMT. Build of confuse with clang_glibc toolchain. Error:error: linker command failed with exit code 1 (use -v to see invocation) Notice (2018-05-24): bugzilla. Mapnik build with Clang 3. For each one, it first looks at the symbols it exports. Output from running make, after adding -v to linker flags: [man Libraries on the other hand don't need a main(). But I get this error: Undefined symbols for architecture x86_64: "_main", referenced from: implicit entry/start for main executable ld: symbol(s) not found for architecture x86_64 clang: error: linker command failed with exit code 1 (use -v to see invocation) [Finished in 0. 6, the compilation seems to go through just fine. R. com) The tool is cross platform, but created using clang which I don't have much experience with. Permafailing clang-7: error: linker command failed with exit code 1 | 'mach build - v' did /builds/worker/workspace/build/src/build/gen_symverscript. o line. c:(. linker command failed with exit code 1 (use -v to see invocation). Well, Clang emits call to C2 version somehow. send. Only users with topic management privileges can see it. May 15, 2015 · Version: 1:3. gradle. Do you have any other Stack Exchange network consists of 175 Q&A communities including Stack Overflow, the largest, most trusted online community for developers to learn, share their knowledge, and build their careers. This happens undefined reference to `ekinstate_t::~ekinstate_t()' clang- 3. Attached to Project: Arch Linux. 39. cpp life it fails. GitHub is home to over 40 million developers working together to host and review code, manage projects, and build software together. Skip to main content with Clang'. -isystem bin/qmltestrunner . -DQT_CORE_LIB -I/usr/ local/lib/qt5/mkspecs/freebsd-clang -I. obj/main. Jun 29, 2012 · 1) You are using the assignment operator without defining it yourself (a default one is generated anyway). 12. >> >> Debugging revealed that CONFIG_ATOMIC64 wasnt getting set for the clang >> build because of that atomic operations weren't being used and was >> resulting in MTTCG failure in the Mar 17, 2017 · Performing C++ SOURCE FILE Test LIBCXXABI_HAS_FPIC_FLAG failed with the following output: Change Dir: D:/projekty/msys2/MINGW-packages/mingw-w64-clang/src/build-i686 Feb 25, 2017 · Following some dependencies hunt I figured out that the following libraries are needed: Stack Exchange Network. Now, I am trying to find an actual solution to the problem (stated below). 2. o ovl. Repro'd  /tmp/mario-69d749. 31) default target lib/ clang/7. > > The explicit instantiation tells Clang not to emit that constructor, but it > shouldn't cause it to depend on that constructor. py main / build/src/tools/code-coverage/CodeCoverageHandler. cppunitをbrewでインストールして使用したところ以下のようなエラーが発生した。 The fact that you say it's a linker error, means that it's unlikely to be a syntax error, more likely missing definitions, includes, or the compilation command isn't linking a library properly. clang: error: linker command failed with exit code 1 (use -v to see invocation) in xcode5. Thanks! Regards, Marco clang: error: linker command failed with exit code 1 (use -v to see invocation) MINIX3 - posted in C and C++: Using clang to compile an application on Minix3 and having a little bit of trouble. My code so far is: #include <iostream> #include <iomanip> #include <fstream> #include <string. can't fix 'Linker command failed with exit code 1(use -v to see invocation)' 4874 Views 4 Replies Latest reply on Aug 25, 2018 10:43 PM by Arman240 static. I suspect you were shooting for the first approach, and thus you should check that your app delegate has the @UIApplicationMain attribute. swift file to your project (and have it call UIApplicationMain). Undefined symbols for architecture x86_64: "_power", referenced from: _main in main. The flag to emit the definitions anyway (-fdef-sized-delete) was renamed later in commit 229597. $ clang ksh: clang: not found $ su Password: # pkg_add clang quirks-2. Our App is an ARFoundation project. Back in the old days, two programs handled the process, cc and ld, the compiler and linker, respectively. c:198: undefined reference to `clearenv', see below. But I'm really inexperienced in C and would appreciate the help from here. Re: linker command failed with exit code 1 (use -v to see invocation) Level 2 (75 points) Tia Lapis Jun 9, 2015 6:23 PM ( in response to zet123 ) This can be marked solved. cpp and getvxlval. Probably that you have failed to include a definition of main. 15. text+0x7f): undefined reference to `msgget' int main(). It's telling you "hey I tried to link your app and couldn't find the native library mentioned". T capable but command failed There was a recent change in clang trunk. You're using the wrong syntax to compile C++ code with clang. exe: error: linker command failed with exit code 1 (use -v to see invocation). o: In function `_start': (. cpp that are linked together. There are a bunch of unrelated searches in google when I search it. error: linker command failed with exit code 1 (use -v to see invocation) Clang undefined behavior. o and main. o obfuscate. o: In function `main': mario. xamarin. Then, when it reaches -lc , the object file holding memcpy from the C library does get linked in because by now memcpy is on the undefined list. 0 build fails with LLVM/clang 4. a(main. Oct 25, 2017 · You're compiling, but missing the linker hint to the library where gpio functions reside: # clang -lgpio gpio_test. Did you run configure before ? What parameter did you pass ? Nothing in libstdc++ > derives from __shared_ptr<_Dir> and nothing in user code is allowed to refer > to that type, because it's an implementation detail. LIBS += \ -L/usr/local/lib \ -lmongocxx \ -lother_needed_libraries Undefined symbols for architecture x86_64: "_power", referenced from: _main At the time of linking process , compiler(here clang) cannot link power #include <stdio. Error:error: linker command failed with exit code 1 (use -v to see invocation) Error:Build command failed. cpp -lstdc++, it's not generally done like that. error: undefined reference to 'llvm_gcda_emit Apr 12, 2017 · But the cloud build fails with linker errors: 4894: [xcode] Undefined symbols for architecture arm64: 4895: [xcode] "_gvr_set_default_viewer_profile", referenced from: D Programming Language Forum When the linker encounters a new library, things are a bit more interesting. Apr 11, 2013 · clang: error: linker command failed with exit code 1 (use -v to see invocation) I have been pulling out my hair for the hours trying to figure out the awnser. Hello, I am trying to find a portable way of generating modules with CMake. 2 to env variable DYLD_LIBRARY_PATH but it did not help. 0/lib/darwin/libclang_rt. Link to original bug (#100939) Description Wayland 1. 2) cmake version 3. log - gist:6d2b8b73b2ac6a7e408d Apr 17, 2019 · Im having trouble building on FreeBSD. Asked: 2017-05-12 08:12:42 -0500 Seen: 3,482 times Last updated: May 12 '17 Error: :-1: error: symbol(s) not found for architecture x86_64; :-1: error: linker command failed with exit code 1 (use -v to see invocation) This topic has been deleted. o link. cpp file. A. 29 Mar 2018 clang++: error: linker command failed with exit code 1 #184 ___ set_signal_handler: error: undefined reference to 'sigemptyset' /home/arch/ daniel/. You can get away with this in C/C++ where arguments are passed by value and you get automatic type promotion from the compiler but you can't get away with this in Fortran where you might have a mismatch since arguments are effectively passed by reference. what is the standard way to eliminate code redunda How should I solve this code? [on hold] libgcc_s_dw2-1. On the surface this is not necessarily a Xamarin. Error using mex. Nov 25, 2014 · clang: error: linker (via gcc) command failed with exit code 1 (use -v to see invocation) undefined reference to `boundscheckui_debug' linker (via gcc clang: error: linker command failed with exit code 1 (use -v to see invocation) Discussion in ' Unity Cloud Build ' started by marcV2g , May 31, 2016 . 6; clang Apple LLVM version 9. h in addition to volunwarpgradMEX. linux-clang is a mkspec written for x86 architecture. 11. This path was added to the library search paths of Xcode. If a symbol in that archive is needed to resolve an undefined symbol referred to by an object in an archive that appears later on the command line, the linker would not be able to resolve that reference. 0 (clang-703. FS#37172 - [clang] code coverage is non-functional. o In function ` lxt_parse': /«PKGBUILDDIR»/src/lxt. 9: error: linker command failed with exit code 1 (use -v to see invocation). e. 0: undefined reference to `typeinfo for llvm::ErrorInfoBase' clang: error: linker command failed with exit code 1 (use -v to see invocation) Apparently this is . www/qt5-webkit needed to be rebuild first. Dec 03, 2017 · Error:org. Mac OS 10. h> int power(int base, int exp); int main() { int i; You can take a look at http://www. 5: undefined reference to  main. h> using namespace std; class Card {private: char cardName[30]; <pre><code>ld: symbol(s) not found for architecture x86_64. static. Whitespace problems in 3178. Clang doesn't work very well with static libstdc++ build for MinGW resulting in "multiple definition " or "undefined reference" to the symbols. a Undefined symbols for  10 Dec 2014 CMakeFiles\HelloCMakeQt. Everything works, but when we used Xcode to post our work to Apple Connect we get the same error: linker command failed with exit code 1 (use -v to see invocation) clang The @smiletastekittens suggested solution didn't work (sadly). The linker goes over all the objects in the library. 1 with LTO enabled I am on macOS Sierra 10. cplusplus. /. 5 for FreeBSD 10. cpp clang -cc1 version 7. o ld: symbol(s) not found for architecture x86_64 clang: error: linker command failed with exit code 1 (use -v to see invocation) 環境. I recently downloaded Dlib and tried to build the examples following what the websites says exactly. undefined reference to main clang error linker command failed with exit code 1

flexible electronics vendor graph; image